{"text_format":"1","workbook":"xlsx","n_sheets":5,"sheets":["TRV-AUTH-FORM","REF","Notes-to-traveler","AR-GSA-RATES","FY2024 Per Diem Rates"],"not_rendered":{"charts":0,"images":4,"macros":1,"external_links":0,"defined_names":5,"comments":1,"pivot_tables":0},"unopened":[],"bounds":{"document_bytes":16777216,"sheet_cells":100000,"rows_first":2000,"rows_last":500,"rows_between":2000,"halvings":0,"cell_chars":16384,"cell_head_chars":4096},"cells_cut":0,"cells_raw":0,"read":"whole","date_system":"1900"}

{"sheet":"TRV-AUTH-FORM","index":0,"n_rows":38,"n_cols":8,"rows_kept":38,"cut":false,"hidden":false,"merged":[[7,3,7,4],[17,6,19,6],[17,7,19,7],[23,4,24,4],[23,2,24,2],[23,3,24,3],[10,3,10,5],[12,3,12,4],[11,3,11,4],[0,0,2,8],[28,3,29,7],[23,5,24,5],[22,6,22,7],[23,6,24,7],[16,0,19,0],[17,3,19,5],[16,3,16,5],[17,1,19,1],[17,2,19,2],[8,3,8,7],[9,3,9,4],[29,1,30,1],[4,3,4,5],[4,6,4,7],[23,1,24,1]]}
["Arkansas Department of Veterans Affairs\nTravel Preauthorization Worksheet                                        \nForm Effective 10/1/2023"]
[]
[]
[null,null,null,null,null,null,"Select from dropdown"]
[null,"1. Trip Details"]
[null,null,null,null,null,null,{"$f":"IFERROR(VLOOKUP(G5,REF!$A:$B,2,FALSE),\"\")","v":""}]
[]
[null,null,null,"Type the traveler(s) name(s) below"]
[1,"Employee(s) Traveling:"]
[null,null,null,"Select from dropdown"]
[2,"Division",null,null,null,null,{"$f":"IFERROR(VLOOKUP(D11,REF!$C:$D,2,FALSE),\"\")","v":""}]
[null,null,null,"Select from dropdown"]
[3,"Official Station",null,null,null,{"$f":"IFERROR(VLOOKUP(D13,REF!$E:$F,2,FALSE),\"\")","v":""},{"$f":"IFERROR(VLOOKUP(D13,REF!$E:$G,3,FALSE),\"\")","v":""}]
[]
[]
[null,"Please provide details of anticipated trip below. "]
[1,"Destination \n(Physical Address)","Trip Classification","Explanation/Purpose for travel",null,null,"Leave Date","Return Date"]
[]
[]
[]
[]
[null,"Please provide estimated costs for the travel below."]
[2,"Estimated Total Mileage","Estimated GSA Lodging Rate (Daily)","Estimated GSA Meal Rate (Daily)","Estimated Airfare","Estimated Other travel costs","Provide explanation supporting other travel costs"]
[]
[]
[]
[]
[]
[3,"Cost Estimate:",null,"All costs provided are \"good faith\" estimates, any costs incurred by the state/agency/travler as a result of this travel that greatly exceed this estimate will require further explanation/documentation."]
[null,{"$f":"(B24*REF!$I$2)+((H18-G18)*C24)+IF(H18-G18>0,(H18-G18-1)*D24+(D24*0.75*2),0)+E24+F24","v":0}]
[]
[]
[]
[]
[null,"2. Budget Verification"]
[]
[]
[null,"3. Approved Travel Req"]

{"sheet":"REF","index":1,"n_rows":16,"n_cols":9,"rows_kept":16,"cut":false,"hidden":true,"merged":[]}
["Manager","Email","Division","Cost Center","Official Station","Street","City/Zip","TripPurposes","CurrStateMileageRate"]
["Kendall Penn","kendall.penn@arkansas.gov","Agency Admin",310241,"Agency Admin(501 Building)","501 Woodlane; Suite401N","Little Rock, AR 72201","02-Official Business",0.52]
["Scott Stanger","scott.stanger@arkansas.gov","ASVH-F",311501,"ASVH-F","1179 N College Ave","Fayetteville, AR 72703","09-Conference"]
["Danny Luncsford","danny.luncsford@arkansas.gov","ASVH-NLR",311514,"ASVH-NLR","2401 John Ashley Dr","North Little Rock, AR  72114","09-Training"]
["Sherrey Bullock  ","Sherrey.Bullock@arkansas.gov","NLR Cem",310222,"NLR Cemetery","1501 W Maryland Ave","North Little Rock, AR 72120","02-Other"]
["Gina Chandler","gina.chandler@arkansas.gov","Birdeye Cem",310226,"Birdeye Cemetery","3600 Hwy 163","Birdeye, AR 72324","09-Other"]
["Stevie Smith","stevie.m.smith@arkansas.gov","Commission Member",310251,"Commission Member"]
["Don Johnson","donald.johnson@arkansas.gov","DVSO ",311213,"DVSO-Jonesboro","511 S. Main Street, Room 118","Jonesboro, AR 72401"]
["Phillip Cappiello","phillip.cappiello@arkansas.gov",null,null,"DVSO-Forrest City","300 Eldridge Road; Suite#2","Forrest City, AR 72335"]
["Richelle Garcia","Richelle.Garcia@arkansas.gov",null,null,"DVSO-Fayetteville","1204 S.W. 14th Street, Suite 8","Bentonville, AR 72712"]
["Darell McGhee","dareell.mcghee@arkansas.gov",null,null,"DVSO -Ft Smith","35 S. 6th Street, Room G6","Fort Smith, AR 72901"]
["Robyn Wertz","robyn.wertz@arkansas.gov",null,null,"DVSO-Mountain Home","1600 S College St","Mountain Home, AR 72653"]
["MaryAnne Parker ","maryanne.parker@arkansas.gov",null,null,"DVSO-NLR","2401 John Ashley Dr","North Little Rock, AR  72114"]
[null,null,null,null,"DVSO-Russellville","104 S. Rochester Ave","Russellville, AR 72801"]
[null,null,null,null,"DVSO-Hope","205 Smith Road, Suite A","Hope, AR 71801"]
[null,null,null,null,"DVSO-Monticello","210 South Main Street","Monticello, AR 71655"]

{"sheet":"Notes-to-traveler","index":2,"n_rows":21,"n_cols":1,"rows_kept":21,"cut":false,"hidden":false,"merged":[]}
["State travel regulations:"]
["http://www.dfa.arkansas.gov/offices/accounting/Documents/travelRegs.pdf"]
[]
["GSA Per Diem lookup tool"]
["http://www.gsa.gov/portal/content/104877"]
[]
["Mileage:"]
["http://maps.google.com"]
["When submitting your tr-1 for this travel, attached a printout of the google maps directions supporting your mileage. "]
["If leaving from your residence: You can only claim mileage for the LESSER of the distance between your home and the destination or your official station and the destination."]
[]
["Meals:"]
["Meals are only allowed when the trip involves overnight travel. Only 15% maximum gratuity on meals will be reimbursed by the state."]
[]
[]
["FORMS:"]
["TR-1: "]
["http://www.dfa.arkansas.gov/offices/accounting/Documents/tr1.pdf"]
[]
[]
["Travel Exp Recon: This form must be completed and submitted with the TR-1 when not all of the expenses are paid for directly by the traveler. I.E. hotel and or airfare were paid for with agency corporate travel card. "]

{"sheet":"AR-GSA-RATES","index":3,"n_rows":681,"n_cols":9,"rows_kept":681,"cut":false,"hidden":false,"merged":[[0,1,0,5],[1,0,1,16383]]}
[null,"https://www.gsa.gov/travel/plan-book/per-diem-rates/per-diem-files"]
["NOTE TO TRAVELER: The below rates are to be used for estimates only, when completing your TR-1 use the GSA lookup tool for actual figures."]
[]
[null,"FY2024 Per Diem Rates - Effective October 1, 2023"]
["ID","STATE","DESTINATION","COUNTY/LOCATION DEFINED","SEASON BEGIN","SEASON END","FY24 Lodging Rate","FY24 M&IE Rate","FY24 M&IE Rate 1st and Last Days"]
[null,null,"Standard CONUS rate applies to all counties not specifically listed. Cities not listed may be located in a listed county."]
[null,"ARKANSAS STATEWIDE","STANDARD AR RATE",null,null,null,107,59,{"$f":"H7*75%","v":44.25}]
[1,"AL","Birmingham","Jefferson","","",113,69,{"$f":"H8*75%","v":51.75}]
[2,"AL","Gulf Shores","Baldwin","October 1","February 28",111,69,51.75]
[2,"AL","Gulf Shores","Baldwin","March 1","May 31",136,69,51.75]
[2,"AL","Gulf Shores","Baldwin","June 1","July 31",173,69,51.75]
[460,"AL","Gulf Shores","Baldwin","August 1","September 30",111,69,51.75]
[460,"AL","Mobile","Mobile","October 1","December 31",96,59,44.25]
[460,"AL","Mobile","Mobile","January 1","March 31",105,59,44.25]
[6,"AL","Mobile","Mobile","April 1","September 30",96,59,44.25]
[7,"AR","Hot Springs","Garland","","",103,64,48]
[9,"AZ","Grand Canyon / Flagstaff","Coconino / Yavapai less the city of Sedona","October 1","October 31",138,74,55.5]
[9,"AZ","Grand Canyon / Flagstaff","Coconino / Yavapai less the city of Sedona","November 1","February 28",96,74,55.5]
[9,"AZ","Grand Canyon / Flagstaff","Coconino / Yavapai less the city of Sedona","March 1","April 30",118,74,55.5]
[8,"AZ","Grand Canyon / Flagstaff","Coconino / Yavapai less the city of Sedona","May 1","September 30",138,74,55.5]
[10,"AZ","Kayenta","Navajo","October 1","October 31",134,64,48]
[10,"AZ","Kayenta","Navajo","November 1","February 28",102,64,48]
[10,"AZ","Kayenta","Navajo","March 1","September 30",134,64,48]
[10,"AZ","Phoenix / Scottsdale","Maricopa","October 1","May 31",151,69,51.75]
[10,"AZ","Phoenix / Scottsdale","Maricopa","June 1","August 31",96,69,51.75]
[11,"AZ","Phoenix / Scottsdale","Maricopa","September 1","September 30",151,69,51.75]
[11,"AZ","Sedona","City Limits of Sedona","October 1","December 31",180,79,59.25]
[11,"AZ","Sedona","City Limits of Sedona","January 1","February 28",146,79,59.25]
[12,"AZ","Sedona","City Limits of Sedona","March 1","April 30",220,79,59.25]
[12,"AZ","Sedona","City Limits of Sedona","May 1","August 31",154,79,59.25]
[12,"AZ","Sedona","City Limits of Sedona","September 1","September 30",180,79,59.25]
[14,"AZ","Tucson","Pima","October 1","December 31",96,64,48]
[481,"AZ","Tucson","Pima","January 1","March 31",133,64,48]
[16,"AZ","Tucson","Pima","April 1","September 30",96,64,48]
[20,"CA","Antioch / Brentwood / Concord","Contra Costa","","",165,74,55.5]
[461,"CA","Bakersfield / Ridgecrest","Kern","","",116,64,48]
[461,"CA","Barstow / Ontario / Victorville","San Bernardino","","",111,64,48]
[461,"CA","Death Valley","Inyo / NAWS China Lake","October 1","October 31",130,69,51.75]
[21,"CA","Death Valley","Inyo / NAWS China Lake","November 1","January 31",109,69,51.75]
[22,"CA","Death Valley","Inyo / NAWS China Lake","February 1","September 30",130,69,51.75]
[22,"CA","Eureka / Arcata / McKinleyville","Humboldt","October 1","May 31",101,69,51.75]
[22,"CA","Eureka / Arcata / McKinleyville","Humboldt","June 1","August 31",129,69,51.75]
[23,"CA","Eureka / Arcata / McKinleyville","Humboldt","September 1","September 30",101,69,51.75]
[23,"CA","Fresno","Fresno","","",110,69,51.75]
[23,"CA","Los Angeles","Los Angeles / Orange / Ventura / Edwards AFB less the city of Santa Monica","October 1","October 31",182,74,55.5]
[24,"CA","Los Angeles","Los Angeles / Orange / Ventura / Edwards AFB less the city of Santa Monica","November 1","December 31",168,74,55.5]
[24,"CA","Los Angeles","Los Angeles / Orange / Ventura / Edwards AFB less the city of Santa Monica","January 1","September 30",182,74,55.5]
[24,"CA","Mammoth Lakes","Mono","October 1","November 30",126,79,59.25]
[26,"CA","Mammoth Lakes","Mono","December 1","April 30",148,79,59.25]
[26,"CA","Mammoth Lakes","Mono","May 1","September 30",126,79,59.25]
[26,"CA","Mill Valley / San Rafael / Novato","Marin","October 1","October 31",189,74,55.5]
[27,"CA","Mill Valley / San Rafael / Novato","Marin","November 1","May 31",166,74,55.5]
[27,"CA","Mill Valley / San Rafael / Novato","Marin","June 1","September 30",189,74,55.5]
[27,"CA","Monterey","Monterey","October 1","May 31",166,74,55.5]
[28,"CA","Monterey","Monterey","June 1","August 31",240,74,55.5]
[28,"CA","Monterey","Monterey","September 1","September 30",166,74,55.5]
[28,"CA","Napa","Napa","October 1","November 30",213,79,59.25]
[29,"CA","Napa","Napa","December 1","March 31",160,79,59.25]
[30,"CA","Napa","Napa","April 1","September 30",213,79,59.25]
[30,"CA","Oakhurst","Madera ","October 1","April 30",104,69,51.75]
[30,"CA","Oakhurst","Madera ","May 1","September 30",137,69,51.75]
[31,"CA","Oakland","Alameda","","",189,74,55.5]
[32,"CA","Palm Springs","Riverside","October 1","October 31",114,69,51.75]
[33,"CA","Palm Springs","Riverside","November 1","April 30",144,69,51.75]
[34,"CA","Palm Springs","Riverside","May 1","September 30",114,69,51.75]
[34,"CA","Point Arena / Gualala","Mendocino","","",129,79,59.25]
[34,"CA","Sacramento","Sacramento","","",145,69,51.75]
[35,"CA","San Diego","San Diego","October 1","January 31",161,74,55.5]
[36,"CA","San Diego","San Diego","February 1","July 31",181,74,55.5]
[36,"CA","San Diego","San Diego","August 1","September 30",161,74,55.5]
[36,"CA","San Francisco","San Francisco","October 1","December 31",288,79,59.25]
[37,"CA","San Francisco","San Francisco","January 1","March 31",333,79,{"$f":"H72*75%","v":59.25}]
[37,"CA","San Francisco","San Francisco","April 1","August 31",270,79,59.25]
[37,"CA","San Francisco","San Francisco","September 1","September 30",288,79,59.25]
[38,"CA","San Luis Obispo","San Luis Obispo","","",124,74,55.5]
[38,"CA","San Mateo / Foster City / Belmont","San Mateo","","",222,74,55.5]
[38,"CA","Santa Barbara","Santa Barbara","October 1","June 30",177,74,55.5]
[39,"CA","Santa Barbara","Santa Barbara","July 1","August 31",228,74,55.5]
[39,"CA","Santa Barbara","Santa Barbara","September 1","September 30",177,74,55.5]
[39,"CA","Santa Cruz","Santa Cruz","October 1","May 31",128,69,51.75]
[40,"CA","Santa Cruz","Santa Cruz","June 1","August 31",172,69,51.75]
[40,"CA","Santa Cruz","Santa Cruz","September 1","September 30",128,69,51.75]
[40,"CA","Santa Monica ","City limits of Santa Monica","October 1","May 31",239,79,59.25]
[41,"CA","Santa Monica ","City limits of Santa Monica","June 1","August 31",284,79,59.25]
[41,"CA","Santa Monica ","City limits of Santa Monica","September 1","September 30",239,79,59.25]
[41,"CA","Santa Rosa","Sonoma","","",157,74,55.5]
[42,"CA","South Lake Tahoe","El Dorado","October 1","December 31",135,74,55.5]
[42,"CA","South Lake Tahoe","El Dorado","January 1","June 30",120,74,55.5]
[42,"CA","South Lake Tahoe","El Dorado","July 1","September 30",135,74,55.5]
[42,"CA","Stockton ","San Joaquin","","",140,74,55.5]
[43,"CA","Sunnyvale / Palo Alto / San Jose","Santa Clara","","",245,74,55.5]
[44,"CA","Tahoe City","Placer","","",124,74,55.5]
[44,"CA","Truckee","Nevada ","","",126,79,59.25]
[44,"CA","Visalia","Tulare","","",113,69,51.75]
[45,"CA","West Sacramento / Davis","Yolo","","",133,69,51.75]
[46,"CA","Yosemite National Park","Mariposa","October 1","November 30",120,79,59.25]
[47,"CA","Yosemite National Park","Mariposa","December 1","August 31",136,79,59.25]
[48,"CA","Yosemite National Park","Mariposa","September 1","September 30",120,79,59.25]
[49,"CO","Aspen","Pitkin","October 1","November 30",188,79,59.25]
[49,"CO","Aspen","Pitkin","December 1","March 31",375,79,59.25]
[49,"CO","Aspen","Pitkin","April 1","May 31",147,79,59.25]
[49,"CO","Aspen","Pitkin","June 1","September 30",188,79,59.25]
[50,"CO","Boulder / Broomfield","Boulder / Broomfield","October 1","April 30",128,69,51.75]
[50,"CO","Boulder / Broomfield","Boulder / Broomfield","May 1","August 31",160,69,51.75]
[50,"CO","Boulder / Broomfield","Boulder / Broomfield","September 1","September 30",128,69,51.75]
[50,"CO","Colorado Springs","El Paso","October 1","May 31",112,69,51.75]
[50,"CO","Colorado Springs","El Paso","June 1","August 31",147,69,51.75]
[52,"CO","Colorado Springs","El Paso","September 1","September 30",112,69,51.75]
[53,"CO","Cortez","Montezuma","October 1","May 31",96,64,48]
[54,"CO","Cortez","Montezuma","June 1","September 30",122,64,48]
[54,"CO","Crested Butte / Gunnison","Gunnison","October 1","November 30",126,74,55.5]
[55,"CO","Crested Butte / Gunnison","Gunnison","December 1","March 31",175,74,55.5]
[55,"CO","Crested Butte / Gunnison","Gunnison","April 1","May 31",106,74,55.5]
[55,"CO","Crested Butte / Gunnison","Gunnison","June 1","September 30",126,74,55.5]
[56,"CO","Denver / Aurora","Denver / Adams / Arapahoe / Jefferson","October 1","October 31",199,79,59.25]
[427,"CO","Denver / Aurora","Denver / Adams / Arapahoe / Jefferson","November 1","December 31",153,79,59.25]
[57,"CO","Denver / Aurora","Denver / Adams / Arapahoe / Jefferson","January 1","March 31",162,79,59.25]
[57,"CO","Denver / Aurora","Denver / Adams / Arapahoe / Jefferson","April 1","September 30",199,79,59.25]
[58,"CO","Douglas ","Douglas","October 1","May 31",115,69,51.75]
[493,"CO","Douglas ","Douglas","June 1","August 31",140,69,51.75]
{"$rows_left_out":562}
{"sheet":"FY2024 Per Diem Rates","index":4,"n_rows":669,"n_cols":8,"rows_kept":669,"cut":false,"hidden":false,"merged":[]}
[null,"FY2024 Per Diem Rates - Effective October 1, 2023"]
["ID","STATE","DESTINATION","COUNTY/LOCATION DEFINED","SEASON BEGIN","SEASON END","FY24 Lodging Rate","FY24 M&IE"]
[null,null,"Standard CONUS rate applies to all counties not specifically listed. Cities not listed may be located in a listed county.",null,null,null,107,59]
[1,"AL","Birmingham","Jefferson","","",123,69]
[2,"AL","Gulf Shores","Baldwin","October 1","February 28",137,69]
[2,"AL","Gulf Shores","Baldwin","March 1","May 31",164,69]
[2,"AL","Gulf Shores","Baldwin","June 1","July 31",237,69]
[2,"AL","Gulf Shores","Baldwin","August 1","September 30",137,69]
[3,"AL","Huntsville","Madison","","",127,74]
[460,"AL","Mobile","Mobile","October 1","December 31",111,59]
[460,"AL","Mobile","Mobile","January 1","March 31",120,59]
[460,"AL","Mobile","Mobile","April 1","September 30",111,59]
[6,"AR","Hot Springs","Garland","","",111,64]
[9,"AZ","Grand Canyon / Flagstaff","Coconino / Yavapai less the city of Sedona","October 1","October 31",141,74]
[9,"AZ","Grand Canyon / Flagstaff","Coconino / Yavapai less the city of Sedona","November 1","February 28",107,74]
[9,"AZ","Grand Canyon / Flagstaff","Coconino / Yavapai less the city of Sedona","March 1","April 30",139,74]
[9,"AZ","Grand Canyon / Flagstaff","Coconino / Yavapai less the city of Sedona","May 1","September 30",141,74]
[8,"AZ","Kayenta","Navajo","","",146,64]
[10,"AZ","Phoenix / Scottsdale","Maricopa","October 1","January 31",156,69]
[10,"AZ","Phoenix / Scottsdale","Maricopa","February 1","March 31",235,69]
[10,"AZ","Phoenix / Scottsdale","Maricopa","April 1","May 31",157,69]
[10,"AZ","Phoenix / Scottsdale","Maricopa","June 1","August 31",110,69]
[10,"AZ","Phoenix / Scottsdale","Maricopa","September 1","September 30",156,69]
[11,"AZ","Sedona","City Limits of Sedona","October 1","December 31",247,79]
[11,"AZ","Sedona","City Limits of Sedona","January 1","February 28",198,79]
[11,"AZ","Sedona","City Limits of Sedona","March 1","April 30",313,79]
[11,"AZ","Sedona","City Limits of Sedona","May 1","August 31",215,79]
[11,"AZ","Sedona","City Limits of Sedona","September 1","September 30",247,79]
[12,"AZ","Tucson","Pima","October 1","December 31",120,64]
[12,"AZ","Tucson","Pima","January 1","March 31",169,64]
[12,"AZ","Tucson","Pima","April 1","September 30",120,64]
[14,"CA","Antioch / Brentwood / Concord","Contra Costa","","",165,74]
[481,"CA","Bakersfield / Ridgecrest","Kern","","",129,64]
[16,"CA","Barstow / Ontario / Victorville","San Bernardino","","",124,64]
[20,"CA","Death Valley","Inyo / NAWS China Lake","","",140,69]
[461,"CA","Eureka / Arcata / McKinleyville","Humboldt","October 1","May 31",124,69]
[461,"CA","Eureka / Arcata / McKinleyville","Humboldt","June 1","August 31",173,69]
[461,"CA","Eureka / Arcata / McKinleyville","Humboldt","September 1","September 30",124,69]
[21,"CA","Fresno","Fresno","","",124,69]
[22,"CA","Los Angeles","Los Angeles / Orange / Ventura / Edwards AFB less the city of Santa Monica","October 1","October 31",183,74]
[22,"CA","Los Angeles","Los Angeles / Orange / Ventura / Edwards AFB less the city of Santa Monica","November 1","December 31",169,74]
[22,"CA","Los Angeles","Los Angeles / Orange / Ventura / Edwards AFB less the city of Santa Monica","January 1","September 30",183,74]
[23,"CA","Mammoth Lakes","Mono","October 1","November 30",142,79]
[23,"CA","Mammoth Lakes","Mono","December 1","June 30",178,79]
[23,"CA","Mammoth Lakes","Mono","July 1","September 30",142,79]
[24,"CA","Mill Valley / San Rafael / Novato","Marin","October 1","October 31",189,74]
[24,"CA","Mill Valley / San Rafael / Novato","Marin","November 1","May 31",166,74]
[24,"CA","Mill Valley / San Rafael / Novato","Marin","June 1","September 30",189,74]
[26,"CA","Monterey","Monterey","October 1","May 31",184,74]
[26,"CA","Monterey","Monterey","June 1","August 31",251,74]
[26,"CA","Monterey","Monterey","September 1","September 30",184,74]
[27,"CA","Napa","Napa","October 1","November 30",265,79]
[27,"CA","Napa","Napa","December 1","February 28",195,79]
[27,"CA","Napa","Napa","March 1","September 30",265,79]
[28,"CA","Oakhurst","Madera ","October 1","April 30",118,69]
[28,"CA","Oakhurst","Madera ","May 1","September 30",149,69]
[29,"CA","Oakland","Alameda","","",189,74]
[30,"CA","Palm Springs","Riverside","October 1","April 30",184,69]
[30,"CA","Palm Springs","Riverside","May 1","September 30",142,69]
[31,"CA","Point Arena / Gualala","Mendocino","","",133,79]
[33,"CA","Sacramento","Sacramento","","",145,69]
[34,"CA","San Diego","San Diego","October 1","May 31",194,74]
[34,"CA","San Diego","San Diego","June 1","August 31",230,74]
[34,"CA","San Diego","San Diego","September 1","September 30",194,74]
[35,"CA","San Francisco","San Francisco","October 1","December 31",288,79]
[35,"CA","San Francisco","San Francisco","January 1","March 31",333,79]
[35,"CA","San Francisco","San Francisco","April 1","August 31",270,79]
[35,"CA","San Francisco","San Francisco","September 1","September 30",288,79]
[36,"CA","San Luis Obispo","San Luis Obispo","October 1","May 31",156,74]
[36,"CA","San Luis Obispo","San Luis Obispo","June 1","August 31",196,74]
[36,"CA","San Luis Obispo","San Luis Obispo","September 1","September 30",156,74]
[37,"CA","San Mateo / Foster City / Belmont","San Mateo","","",222,74]
[38,"CA","Santa Barbara","Santa Barbara","October 1","June 30",214,74]
[38,"CA","Santa Barbara","Santa Barbara","July 1","August 31",289,74]
[38,"CA","Santa Barbara","Santa Barbara","September 1","September 30",214,74]
[39,"CA","Santa Cruz","Santa Cruz","October 1","May 31",143,69]
[39,"CA","Santa Cruz","Santa Cruz","June 1","August 31",181,69]
[39,"CA","Santa Cruz","Santa Cruz","September 1","September 30",143,69]
[40,"CA","Santa Monica ","City limits of Santa Monica","October 1","May 31",270,79]
[40,"CA","Santa Monica ","City limits of Santa Monica","June 1","August 31",298,79]
[40,"CA","Santa Monica ","City limits of Santa Monica","September 1","September 30",270,79]
[41,"CA","Santa Rosa","Sonoma","","",157,74]
[42,"CA","South Lake Tahoe","El Dorado","October 1","March 31",173,74]
[42,"CA","South Lake Tahoe","El Dorado","April 1","May 31",143,74]
[42,"CA","South Lake Tahoe","El Dorado","June 1","September 30",173,74]
[43,"CA","Stockton ","San Joaquin","","",140,74]
[44,"CA","Sunnyvale / Palo Alto / San Jose","Santa Clara","","",245,74]
[45,"CA","Tahoe City","Placer","","",132,74]
[46,"CA","Truckee","Nevada ","October 1","February 28",157,79]
[46,"CA","Truckee","Nevada ","March 1","May 31",137,79]
[46,"CA","Truckee","Nevada ","June 1","August 31",160,79]
[46,"CA","Truckee","Nevada ","September 1","September 30",157,79]
[47,"CA","Visalia","Tulare","","",132,69]
[48,"CA","West Sacramento / Davis","Yolo","","",138,69]
[49,"CA","Yosemite National Park","Mariposa","","",186,79]
[50,"CO","Aspen","Pitkin","October 1","November 30",188,79]
[50,"CO","Aspen","Pitkin","December 1","March 31",375,79]
[50,"CO","Aspen","Pitkin","April 1","May 31",147,79]
[50,"CO","Aspen","Pitkin","June 1","August 31",235,79]
[50,"CO","Aspen","Pitkin","September 1","September 30",188,79]
[52,"CO","Boulder / Broomfield","Boulder / Broomfield","October 1","April 30",135,69]
[52,"CO","Boulder / Broomfield","Boulder / Broomfield","May 1","August 31",176,69]
[52,"CO","Boulder / Broomfield","Boulder / Broomfield","September 1","September 30",135,69]
[53,"CO","Colorado Springs","El Paso","October 1","May 31",127,69]
[53,"CO","Colorado Springs","El Paso","June 1","August 31",178,69]
[53,"CO","Colorado Springs","El Paso","September 1","September 30",127,69]
[54,"CO","Cortez","Montezuma","October 1","October 31",134,64]
[54,"CO","Cortez","Montezuma","November 1","April 30",107,64]
[54,"CO","Cortez","Montezuma","May 1","September 30",134,64]
[55,"CO","Crested Butte / Gunnison","Gunnison","October 1","November 30",147,74]
[55,"CO","Crested Butte / Gunnison","Gunnison","December 1","March 31",175,74]
[55,"CO","Crested Butte / Gunnison","Gunnison","April 1","May 31",119,74]
[55,"CO","Crested Butte / Gunnison","Gunnison","June 1","September 30",147,74]
[56,"CO","Denver / Aurora","Denver / Adams / Arapahoe / Jefferson","October 1","October 31",201,79]
[56,"CO","Denver / Aurora","Denver / Adams / Arapahoe / Jefferson","November 1","December 31",153,79]
[56,"CO","Denver / Aurora","Denver / Adams / Arapahoe / Jefferson","January 1","March 31",169,79]
[56,"CO","Denver / Aurora","Denver / Adams / Arapahoe / Jefferson","April 1","September 30",201,79]
[427,"CO","Douglas ","Douglas","October 1","May 31",115,69]
[427,"CO","Douglas ","Douglas","June 1","August 31",140,69]
[427,"CO","Douglas ","Douglas","September 1","September 30",115,69]
{"$rows_left_out":549}